{"text_format":"3","workbook":"xlsx","n_sheets":3,"sheets":["Übersicht","Aufstellung","Ergebnisse 12er"],"read":"whole","date_system":"1900"}

{"sheet":"Übersicht","index":0,"n_rows":29,"n_cols":92,"rows_kept":29,"merged":[[0,0,0,16],[0,20,0,24],[0,25,0,28],[0,32,0,38],[0,39,0,43],[1,0,1,16],[1,20,1,24],[1,25,1,28],[1,32,1,38],[1,39,1,43],[3,2,3,4],[3,5,3,7],[3,8,3,10],[3,11,3,13],[3,14,3,16],[3,17,3,19],[3,20,3,22],[3,23,3,25],[3,26,3,28],[3,29,3,31],[3,32,3,34],[3,35,3,37],[3,38,3,40],[3,42,3,44],[4,2,4,4],[5,5,5,7],[6,8,6,10],[7,11,7,13],[8,14,8,16],[9,17,9,19],[10,20,10,22],[11,23,11,25],[12,26,12,28],[13,29,13,31],[14,32,14,34],[15,35,15,37],[16,38,16,40],[18,1,18,46],[20,2,20,13],[20,15,20,26],[20,29,20,40],[22,2,22,8],[22,12,22,15],[22,16,22,23],[22,26,22,29],[22,30,22,36],[22,37,22,40],[22,41,22,45],[24,2,24,8],[24,12,24,15],[24,16,24,23],[24,26,24,29],[24,30,24,36],[26,2,26,8],[26,12,26,15],[26,16,26,23],[26,26,26,29],[26,30,26,36],[28,2,28,8],[28,12,28,15],[28,16,28,23],[28,26,28,29],[28,30,28,36]]}
["Jugendrunde „Jeder gegen Jeden“",{"$nulls":19},"Jugend:",{"$nulls":11},"Datum:"]
["Für 12-er Staffeln",{"$nulls":19},"Spieltag:",{"$nulls":11},"Halle:"]
[]
[null,null,{"$f":"IF(B5=0,\"\",B5)","v":""},null,null,{"$f":"IF(B6=0,\"\",B6)","v":""},null,null,{"$f":"IF(B7=0,\"\",B7)","v":""},null,null,{"$f":"IF(B8=0,\"\",B8)","v":""},null,null,{"$f":"IF($B9=0,\"\",$B9)","v":""},null,null,{"$f":"IF($B10=0,\"\",$B10)","v":""},null,null,{"$f":"IF($B11=0,\"\",$B11)","v":""},null,null,{"$f":"IF($B12=0,\"\",$B12)","v":""},null,null,{"$f":"IF($B13=0,\"\",$B13)","v":""},null,null,{"$f":"IF($B14=0,\"\",$B14)","v":""},null,null,{"$f":"IF($B15=0,\"\",$B15)","v":""},null,null,{"$f":"IF($B16=0,\"\",$B16)","v":""},{"$nulls":5},"Pkt.","kl. Punkte",null,null,"Quot.","Platz",{"$nulls":43},"Punkt-Rang"]
[1,{"$f":"IF(Aufstellung!B5<>\"\",Aufstellung!B5,\"\")","v":""},{"$nulls":3},{"$f":"'Ergebnisse 12er'!E52","v":0},":",{"$f":"'Ergebnisse 12er'!G52","v":0},{"$f":"'Ergebnisse 12er'!L43","v":0},":",{"$f":"'Ergebnisse 12er'!N43","v":0},{"$f":"'Ergebnisse 12er'!E43","v":0},":",{"$f":"'Ergebnisse 12er'!G43","v":0},{"$f":"'Ergebnisse 12er'!L33","v":0},":",{"$f":"'Ergebnisse 12er'!N33","v":0},{"$f":"'Ergebnisse 12er'!E33","v":0},":",{"$f":"'Ergebnisse 12er'!G33","v":0},{"$f":"'Ergebnisse 12er'!E3","v":0},":",{"$f":"'Ergebnisse 12er'!G3","v":0},{"$f":"'Ergebnisse 12er'!L3","v":0},":",{"$f":"'Ergebnisse 12er'!N3","v":0},{"$f":"'Ergebnisse 12er'!E13","v":0},":",{"$f":"'Ergebnisse 12er'!G13","v":0},{"$f":"'Ergebnisse 12er'!L13","v":0},":",{"$f":"'Ergebnisse 12er'!N13","v":0},{"$f":"'Ergebnisse 12er'!E23","v":0},":",{"$f":"'Ergebnisse 12er'!G23","v":0},{"$f":"'Ergebnisse 12er'!L23","v":0},":",{"$f":"'Ergebnisse 12er'!N23","v":0},{"$nulls":3},{"$f":"CI5","v":0},{"$f":"IF((C5+F5+I5+L5+O5+R5+U5+X5+AA5+AD5+AG5+AJ5+AM5)=0,0,(C5+F5+I5+L5+O5+R5+U5+X5+AA5+AD5+AG5+AJ5+AM5))","v":0},":",{"$f":"IF((E5+H5+K5+N5+Q5+T5+W5+Z5+AC5+AF5+AI5+AL5+AO5)=0,0,(E5+H5+K5+N5+Q5+T5+W5+Z5+AC5+AF5+AI5+AL5+AO5))","v":0},{"$f":"IF(AQ5<>AS5,IF(AQ5=0,\"MIN\",IF(AS5=0,\"MAX\",AQ5/AS5)),\"0\")","v":"0"},{"$f":"IF(AND(AQ5=0,AS5=0),\"\",CM5)","v":""},null,{"$f":"IF(OR(C5<>0,E5<>0),IF(C5>E5,2,IF(C5=E5,1,0)),0)","v":0},null,null,{"$f":"IF(OR(F5<>0,H5<>0),IF(F5>H5,2,IF(F5=H5,1,0)),0)","v":0},null,null,{"$f":"IF(OR(I5<>0,K5<>0),IF(I5>K5,2,IF(I5=K5,1,0)),0)","v":0},null,null,{"$f":"IF(OR(L5<>0,N5<>0),IF(L5>N5,2,IF(L5=N5,1,0)),0)","v":0},null,null,{"$f":"IF(OR(O5<>0,Q5<>0),IF(O5>Q5,2,IF(O5=Q5,1,0)),0)","v":0},null,null,{"$f":"IF(OR(R5<>0,T5<>0),IF(R5>T5,2,IF(R5=T5,1,0)),0)","v":0},null,null,{"$f":"IF(OR(U5<>0,W5<>0),IF(U5>W5,2,IF(U5=W5,1,0)),0)","v":0},null,null,{"$f":"IF(OR(X5<>0,Z5<>0),IF(X5>Z5,2,IF(X5=Z5,1,0)),0)","v":0},null,null,{"$f":"IF(OR(AA5<>0,AC5<>0),IF(AA5>AC5,2,IF(AA5=AC5,1,0)),0)","v":0},null,null,{"$f":"IF(OR(AD5<>0,AF5<>0),IF(AD5>AF5,2,IF(AD5=AF5,1,0)),0)","v":0},null,null,{"$f":"IF(OR(AG5<>0,AI5<>0),IF(AG5>AI5,2,IF(AG5=AI5,1,0)),0)","v":0},null,null,{"$f":"IF(OR(AJ5<>0,AL5<>0),IF(AJ5>AL5,2,IF(AJ5=AL5,1,0)),0)","v":0},null,null,{"$f":"IF(OR(AM5<>0,AO5<>0),IF(AM5>AO5,2,IF(AM5=AO5,1,0)),0)","v":0},null,{"$f":"AW5+AZ5+BC5+BF5+BI5+BL5+BO5+BR5+BU5+BX5+CA5+CD5+CG5","v":0},{"$nulls":3},{"$f":"RANK(AP5,$AP$5:$AP$17,0)","v":1},{"$f":"B5","v":""}]
[2,{"$f":"IF(Aufstellung!D5<>\"\",Aufstellung!D5,\"\")","v":""},{"$f":"H5","v":0},":",{"$f":"F5","v":0},null,":",null,{"$f":"'Ergebnisse 12er'!E28","v":0},":",{"$f":"'Ergebnisse 12er'!G28","v":0},{"$f":"'Ergebnisse 12er'!N44","v":0},":",{"$f":"'Ergebnisse 12er'!L44","v":0},{"$f":"'Ergebnisse 12er'!L17","v":0},":",{"$f":"'Ergebnisse 12er'!N17","v":0},{"$f":"'Ergebnisse 12er'!G45","v":0},":",{"$f":"'Ergebnisse 12er'!E45","v":0},{"$f":"'Ergebnisse 12er'!N28","v":0},":",{"$f":"'Ergebnisse 12er'!L28","v":0},{"$f":"'Ergebnisse 12er'!E4","v":0},":",{"$f":"'Ergebnisse 12er'!G4","v":0},{"$f":"'Ergebnisse 12er'!G37","v":0},":",{"$f":"'Ergebnisse 12er'!E37","v":0},{"$f":"'Ergebnisse 12er'!L5","v":0},":",{"$f":"'Ergebnisse 12er'!N5","v":0},{"$f":"'Ergebnisse 12er'!N36","v":0},":",{"$f":"'Ergebnisse 12er'!L36","v":0},{"$f":"'Ergebnisse 12er'!E16","v":0},":",{"$f":"'Ergebnisse 12er'!G16","v":0},{"$nulls":3},{"$f":"CI6","v":0},{"$f":"IF((C6+F6+I6+L6+O6+R6+U6+X6+AA6+AD6+AG6+AJ6+AM6)=0,0,(C6+F6+I6+L6+O6+R6+U6+X6+AA6+AD6+AG6+AJ6+AM6))","v":0},":",{"$f":"IF((E6+H6+K6+N6+Q6+T6+W6+Z6+AC6+AF6+AI6+AL6+AO6)=0,0,(E6+H6+K6+N6+Q6+T6+W6+Z6+AC6+AF6+AI6+AL6+AO6))","v":0},{"$f":"IF(AQ6<>AS6,IF(AQ6=0,\"MIN\",IF(AS6=0,\"MAX\",AQ6/AS6)),\"0\")","v":"0"},{"$f":"IF(AND(AQ6=0,AS6=0),\"\",CM6)","v":""},null,{"$f":"IF(OR(C6<>0,E6<>0),IF(C6>E6,2,IF(C6=E6,1,0)),0)","v":0},null,null,{"$f":"IF(OR(F6<>0,H6<>0),IF(F6>H6,2,IF(F6=H6,1,0)),0)","v":0},null,null,{"$f":"IF(OR(I6<>0,K6<>0),IF(I6>K6,2,IF(I6=K6,1,0)),0)","v":0},null,null,{"$f":"IF(OR(L6<>0,N6<>0),IF(L6>N6,2,IF(L6=N6,1,0)),0)","v":0},null,null,{"$f":"IF(OR(O6<>0,Q6<>0),IF(O6>Q6,2,IF(O6=Q6,1,0)),0)","v":0},null,null,{"$f":"IF(OR(R6<>0,T6<>0),IF(R6>T6,2,IF(R6=T6,1,0)),0)","v":0},null,null,{"$f":"IF(OR(U6<>0,W6<>0),IF(U6>W6,2,IF(U6=W6,1,0)),0)","v":0},null,null,{"$f":"IF(OR(X6<>0,Z6<>0),IF(X6>Z6,2,IF(X6=Z6,1,0)),0)","v":0},null,null,{"$f":"IF(OR(AA6<>0,AC6<>0),IF(AA6>AC6,2,IF(AA6=AC6,1,0)),0)","v":0},null,null,{"$f":"IF(OR(AD6<>0,AF6<>0),IF(AD6>AF6,2,IF(AD6=AF6,1,0)),0)","v":0},null,null,{"$f":"IF(OR(AG6<>0,AI6<>0),IF(AG6>AI6,2,IF(AG6=AI6,1,0)),0)","v":0},null,null,{"$f":"IF(OR(AJ6<>0,AL6<>0),IF(AJ6>AL6,2,IF(AJ6=AL6,1,0)),0)","v":0},null,null,{"$f":"IF(OR(AM6<>0,AO6<>0),IF(AM6>AO6,2,IF(AM6=AO6,1,0)),0)","v":0},null,{"$f":"AW6+AZ6+BC6+BF6+BI6+BL6+BO6+BR6+BU6+BX6+CA6+CD6+CG6","v":0},{"$nulls":3},1,""]
[3,{"$f":"IF(Aufstellung!F5<>\"\",Aufstellung!F5,\"\")","v":""},{"$f":"K5","v":0},":",{"$f":"I5","v":0},{"$f":"K6","v":0},":",{"$f":"I6","v":0},null,":",null,{"$f":"'Ergebnisse 12er'!L18","v":0},":",{"$f":"'Ergebnisse 12er'!N18","v":0},{"$f":"'Ergebnisse 12er'!G44","v":0},":",{"$f":"'Ergebnisse 12er'!E44","v":0},{"$f":"'Ergebnisse 12er'!E17","v":0},":",{"$f":"'Ergebnisse 12er'!G17","v":0},{"$f":"'Ergebnisse 12er'!E53","v":0},":",{"$f":"'Ergebnisse 12er'!G53","v":0},{"$f":"'Ergebnisse 12er'!N27","v":0},":",{"$f":"'Ergebnisse 12er'!L27","v":0},{"$f":"'Ergebnisse 12er'!E5","v":0},":",{"$f":"'Ergebnisse 12er'!G5","v":0},{"$f":"'Ergebnisse 12er'!G36","v":0},":",{"$f":"'Ergebnisse 12er'!E36","v":0},{"$f":"'Ergebnisse 12er'!L6","v":0},":",{"$f":"'Ergebnisse 12er'!N6","v":0},{"$f":"'Ergebnisse 12er'!N35","v":0},":",{"$f":"'Ergebnisse 12er'!L35","v":0},{"$nulls":3},0,0,":",0,"0","",null,0,null,null,0,null,null,0,null,null,0,null,null,0,null,null,0,null,null,0,null,null,0,null,null,0,null,null,0,null,null,0,null,null,0,null,null,0,null,0,{"$nulls":3},1,""]
[4,{"$f":"IF(Aufstellung!H5<>\"\",Aufstellung!H5,\"\")","v":""},{"$f":"N5","v":0},":",{"$f":"L5","v":0},{"$f":"N6","v":0},":",{"$f":"L6","v":0},{"$f":"N7","v":0},":",{"$f":"L7","v":0},null,":",null,{"$f":"'Ergebnisse 12er'!E18","v":0},":",{"$f":"'Ergebnisse 12er'!G18","v":0},{"$f":"'Ergebnisse 12er'!N34","v":0},":",{"$f":"'Ergebnisse 12er'!L34","v":0},{"$f":"'Ergebnisse 12er'!G27","v":0},":",{"$f":"'Ergebnisse 12er'!E27","v":0},{"$f":"'Ergebnisse 12er'!E54","v":0},":",{"$f":"'Ergebnisse 12er'!G54","v":0},{"$f":"'Ergebnisse 12er'!N26","v":0},":",{"$f":"'Ergebnisse 12er'!L26","v":0},{"$f":"'Ergebnisse 12er'!E6","v":0},":",{"$f":"'Ergebnisse 12er'!G6","v":0},{"$f":"'Ergebnisse 12er'!G35","v":0},":",{"$f":"'Ergebnisse 12er'!E35","v":0},{"$f":"'Ergebnisse 12er'!L7","v":0},":",{"$f":"'Ergebnisse 12er'!N7","v":0},{"$nulls":3},0,0,":",0,"0","",null,0,null,null,0,null,null,0,null,null,0,null,null,0,null,null,0,null,null,0,null,null,0,null,null,0,null,null,0,null,null,0,null,null,0,null,null,0,null,0,{"$nulls":3},1,""]
[5,{"$f":"IF(Aufstellung!J5<>\"\",Aufstellung!J5,\"\")","v":""},{"$f":"Q5","v":0},":",{"$f":"O5","v":0},{"$f":"Q6","v":0},":",{"$f":"O6","v":0},{"$f":"Q7","v":0},":",{"$f":"O7","v":0},{"$f":"Q8","v":0},":",{"$f":"O8","v":0},null,":",null,{"$f":"'Ergebnisse 12er'!L8","v":0},":",{"$f":"'Ergebnisse 12er'!N8","v":0},{"$f":"'Ergebnisse 12er'!L45","v":0},":",{"$f":"'Ergebnisse 12er'!N45","v":0},{"$f":"'Ergebnisse 12er'!G26","v":0},":",{"$f":"'Ergebnisse 12er'!E26","v":0},{"$f":"'Ergebnisse 12er'!E55","v":0},":",{"$f":"'Ergebnisse 12er'!G55","v":0},{"$f":"'Ergebnisse 12er'!N25","v":0},":",{"$f":"'Ergebnisse 12er'!L25","v":0},{"$f":"'Ergebnisse 12er'!E7","v":0},":",{"$f":"'Ergebnisse 12er'!G7","v":0},{"$f":"'Ergebnisse 12er'!G34","v":0},":",{"$f":"'Ergebnisse 12er'!E34","v":0},{"$nulls":3},0,0,":",0,"0","",null,0,null,null,0,null,null,0,null,null,0,null,null,0,null,null,0,null,null,0,null,null,0,null,null,0,null,null,0,null,null,0,null,null,0,null,null,0,null,0,{"$nulls":3},1,""]
[6,{"$f":"IF(Aufstellung!L5<>\"\",Aufstellung!L5,\"\")","v":""},{"$f":"T5","v":0},":",{"$f":"R5","v":0},{"$f":"T6","v":0},":",{"$f":"R6","v":0},{"$f":"T7","v":0},":",{"$f":"R7","v":0},{"$f":"T8","v":0},":",{"$f":"R8","v":0},{"$f":"T9","v":0},":",{"$f":"R9","v":0},null,":",null,{"$f":"'Ergebnisse 12er'!N16","v":0},":",{"$f":"'Ergebnisse 12er'!L16","v":0},{"$f":"'Ergebnisse 12er'!L46","v":0},":",{"$f":"'Ergebnisse 12er'!N46","v":0},{"$f":"'Ergebnisse 12er'!G25","v":0},":",{"$f":"'Ergebnisse 12er'!E25","v":0},{"$f":"'Ergebnisse 12er'!E56","v":0},":",{"$f":"'Ergebnisse 12er'!G56","v":0},{"$f":"'Ergebnisse 12er'!N24","v":0},":",{"$f":"'Ergebnisse 12er'!L24","v":0},{"$f":"'Ergebnisse 12er'!E8","v":0},":",{"$f":"'Ergebnisse 12er'!G8","v":0},{"$nulls":3},0,0,":",0,"0","",null,0,null,null,0,null,null,0,null,null,0,null,null,0,null,null,0,null,null,0,null,null,0,null,null,0,null,null,0,null,null,0,null,null,0,null,null,0,null,0,{"$nulls":3},1,""]
[7,{"$f":"IF(Aufstellung!B11<>\"\",Aufstellung!B11,\"\")","v":""},{"$f":"W5","v":0},":",{"$f":"U5","v":0},{"$f":"W6","v":0},":",{"$f":"U6","v":0},{"$f":"W7","v":0},":",{"$f":"U7","v":0},{"$f":"W8","v":0},":",{"$f":"U8","v":0},{"$f":"W9","v":0},":",{"$f":"U9","v":0},{"$f":"W10","v":0},":",{"$f":"U10","v":0},null,":",null,{"$f":"'Ergebnisse 12er'!G38","v":0},":",{"$f":"'Ergebnisse 12er'!E38","v":0},{"$f":"'Ergebnisse 12er'!L4","v":0},":",{"$f":"'Ergebnisse 12er'!N4","v":0},{"$f":"'Ergebnisse 12er'!N37","v":0},":",{"$f":"'Ergebnisse 12er'!L37","v":0},{"$f":"'Ergebnisse 12er'!E15","v":0},":",{"$f":"'Ergebnisse 12er'!G15","v":0},{"$f":"'Ergebnisse 12er'!G46","v":0},":",{"$f":"'Ergebnisse 12er'!E46","v":0},{"$nulls":3},0,0,":",0,"0","",null,0,null,null,0,null,null,0,null,null,0,null,null,0,null,null,0,null,null,0,null,null,0,null,null,0,null,null,0,null,null,0,null,null,0,null,null,0,null,0,{"$nulls":3},1,{"$f":"#REF!","v":{"$error":"#REF!"}}]
[8,{"$f":"IF(Aufstellung!D11<>\"\",Aufstellung!D11,\"\")","v":""},{"$f":"Z5","v":0},":",{"$f":"X5","v":0},{"$f":"Z6","v":0},":",{"$f":"X6","v":0},{"$f":"Z7","v":0},":",{"$f":"X7","v":0},{"$f":"Z8","v":0},":",{"$f":"X8","v":0},{"$f":"Z9","v":0},":",{"$f":"X9","v":0},{"$f":"Z10","v":0},":",{"$f":"X10","v":0},{"$f":"Z11","v":0},":",{"$f":"X11","v":0},null,":",null,{"$f":"'Ergebnisse 12er'!N38","v":0},":",{"$f":"'Ergebnisse 12er'!L38","v":0},{"$f":"'Ergebnisse 12er'!E14","v":0},":",{"$f":"'Ergebnisse 12er'!G14","v":0},{"$f":"'Ergebnisse 12er'!G47","v":0},":",{"$f":"'Ergebnisse 12er'!E47","v":0},{"$f":"'Ergebnisse 12er'!L15","v":0},":",{"$f":"'Ergebnisse 12er'!N15","v":0},{"$nulls":3},0,0,":",0,"0","",null,0,null,null,0,null,null,0,null,null,0,null,null,0,null,null,0,null,null,0,null,null,0,null,null,0,null,null,0,null,null,0,null,null,0,null,null,0,null,0,{"$nulls":3},1,{"$f":"B11","v":""}]
[9,{"$f":"IF(Aufstellung!F11<>\"\",Aufstellung!F11,\"\")","v":""},{"$f":"AC5","v":0},":",{"$f":"AA5","v":0},{"$f":"AC6","v":0},":",{"$f":"AA6","v":0},{"$f":"AC7","v":0},":",{"$f":"AA7","v":0},{"$f":"AC8","v":0},":",{"$f":"AA8","v":0},{"$f":"AC9","v":0},":",{"$f":"AA9","v":0},{"$f":"AC10","v":0},":",{"$f":"AA10","v":0},{"$f":"AC11","v":0},":",{"$f":"AA11","v":0},{"$f":"AC12","v":0},":",{"$f":"AA12","v":0},null,":",null,{"$f":"'Ergebnisse 12er'!G48","v":0},":",{"$f":"'Ergebnisse 12er'!E48","v":0},{"$f":"'Ergebnisse 12er'!L14","v":0},":",{"$f":"'Ergebnisse 12er'!N14","v":0},{"$f":"'Ergebnisse 12er'!N47","v":0},":",{"$f":"'Ergebnisse 12er'!L47","v":0},{"$nulls":3},0,0,":",0,"0","",null,0,null,null,0,null,null,0,null,null,0,null,null,0,null,null,0,null,null,0,null,null,0,null,null,0,null,null,0,null,null,0,null,null,0,null,null,0,null,0,{"$nulls":3},1,""]
[10,{"$f":"IF(Aufstellung!H11<>\"\",Aufstellung!H11,\"\")","v":""},{"$f":"AF5","v":0},":",{"$f":"AD5","v":0},{"$f":"AF6","v":0},":",{"$f":"AD6","v":0},{"$f":"AF7","v":0},":",{"$f":"AD7","v":0},{"$f":"AF8","v":0},":",{"$f":"AD8","v":0},{"$f":"AF9","v":0},":",{"$f":"AD9","v":0},{"$f":"AF10","v":0},":",{"$f":"AD10","v":0},{"$f":"AF11","v":0},":",{"$f":"AD11","v":0},{"$f":"AF12","v":0},":",{"$f":"AD12","v":0},{"$f":"AF13","v":0},":",{"$f":"AD13","v":0},null,":",null,{"$f":"'Ergebnisse 12er'!N48","v":0},":",{"$f":"'Ergebnisse 12er'!L48","v":0},{"$f":"'Ergebnisse 12er'!E24","v":0},":",{"$f":"'Ergebnisse 12er'!G24","v":0},{"$nulls":3},0,0,":",0,"0","",null,0,null,null,0,null,null,0,null,null,0,null,null,0,null,null,0,null,null,0,null,null,0,null,null,0,null,null,0,null,null,0,null,null,0,null,null,0,null,0,{"$nulls":3},1,""]
[11,{"$f":"IF(Aufstellung!J11<>\"\",Aufstellung!J11,\"\")","v":""},{"$f":"AI5","v":0},":",{"$f":"AG5","v":0},{"$f":"AI6","v":0},":",{"$f":"AG6","v":0},{"$f":"AI7","v":0},":",{"$f":"AG7","v":0},{"$f":"AI8","v":0},":",{"$f":"AG8","v":0},{"$f":"AI9","v":0},":",{"$f":"AG9","v":0},{"$f":"AI10","v":0},":",{"$f":"AG10","v":0},{"$f":"AI11","v":0},":",{"$f":"AG11","v":0},{"$f":"AI12","v":0},":",{"$f":"AG12","v":0},{"$f":"AI13","v":0},":",{"$f":"AG13","v":0},{"$f":"AI14","v":0},":",{"$f":"AG14","v":0},null,":",null,{"$f":"'Ergebnisse 12er'!G57","v":0},":",{"$f":"'Ergebnisse 12er'!E57","v":0},{"$nulls":3},0,0,":",0,"0","",null,0,null,null,0,null,null,0,null,null,0,null,null,0,null,null,0,null,null,0,null,null,0,null,null,0,null,null,0,null,null,0,null,null,0,null,null,0,null,0,{"$nulls":3},1,""]
[12,{"$f":"IF(Aufstellung!L11<>\"\",Aufstellung!L11,\"\")","v":""},{"$f":"AL5","v":0},":",{"$f":"AJ5","v":0},{"$f":"AL6","v":0},":",{"$f":"AJ6","v":0},{"$f":"AL7","v":0},":",{"$f":"AJ7","v":0},{"$f":"AL8","v":0},":",{"$f":"AJ8","v":0},{"$f":"AL9","v":0},":",{"$f":"AJ9","v":0},{"$f":"AL10","v":0},":",{"$f":"AJ10","v":0},{"$f":"AL11","v":0},":",{"$f":"AJ11","v":0},{"$f":"AL12","v":0},":",{"$f":"AJ12","v":0},{"$f":"AL13","v":0},":",{"$f":"AJ13","v":0},{"$f":"AL14","v":0},":",{"$f":"AJ14","v":0},{"$f":"AL15","v":0},":",{"$f":"AJ15","v":0},null,":",{"$nulls":4},0,0,":",0,"0","",null,0,null,null,0,null,null,0,null,null,0,null,null,0,null,null,0,null,null,0,null,null,0,null,null,0,null,null,0,null,null,0,null,null,0,null,null,0,null,0,{"$nulls":3},1,""]
[{"$nulls":39},":",null,0,0,":",0,"0","",null,0,null,null,0,null,null,0,null,null,0,null,null,0,null,null,0,null,null,0,null,null,0,null,null,0,null,null,0,null,null,0,null,null,0,null,null,0,null,0,{"$nulls":3},1,""]
[]
[null,"Ergebnisübersicht"]
[]
[]
[]
[null,"Platz 1",{"$nulls":10},"Platz 5",{"$nulls":13},"Platz 9",{"$nulls":10},"Platz 13"]
[]
[null,"Platz 2",{"$nulls":10},"Platz 6",{"$nulls":13},"Platz 10"]
[]
[null,"Platz 3",{"$nulls":10},"Platz 7",{"$nulls":13},"Platz 11"]
[]
[null,"Platz 4",{"$nulls":10},"Platz 8",{"$nulls":13},"Platz 12"]

{"sheet":"Aufstellung","index":1,"n_rows":18,"n_cols":12,"rows_kept":18}
[null,"Fenster",null,"Fenster",null,"Fenster",null,"Fenster",null,"Fenster",null,"Fenster"]
[]
[]
[null,"Team 1:",null,"Team 2:",null,"Team 3:",null,"Team 4:",null,"Team 5:",null,"Team 6:"]
[]
[]
[null,"FEST"]
[]
[]
[null,"Team 7:",null,"Team 8:",null,"Team 9:",null,"Team 10:",null,"Team 11:",null,"Team 12:"]
[]
[]
[]
[]
[]
[{"$nulls":5},"TÜR"]
[]
[null,"ROTATION IM UHRZEIGERSINN!!!"]

{"sheet":"Ergebnisse 12er","index":2,"n_rows":58,"n_cols":13,"rows_kept":58,"merged":[[1,1,1,6],[1,8,1,13],[11,1,11,6],[11,8,11,13],[21,1,21,6],[21,8,21,13],[31,1,31,6],[31,8,31,13],[41,1,41,6],[41,8,41,13],[50,1,50,6]]}
[]
[null,"Runde 1",{"$nulls":6},"Runde 2"]
[null,{"$f":"IF(Aufstellung!B5=\"\",\"Team 1\",Aufstellung!B5)","v":"Team 1"},":",{"$f":"IF(Aufstellung!B11=\"\",\"Team 7\",Aufstellung!B11)","v":"Team 7"},null,":",null,null,{"$f":"B3","v":"Team 1"},":",{"$f":"D4","v":"Team 8"},null,":"]
[null,{"$f":"IF(Aufstellung!D5=\"\",\"Team 2\",Aufstellung!D5)","v":"Team 2"},":",{"$f":"IF(Aufstellung!D11=\"\",\"Team 8\",Aufstellung!D11)","v":"Team 8"},null,":",null,null,{"$f":"D3","v":"Team 7"},":",{"$f":"D5","v":"Team 9"},null,":"]
[null,{"$f":"IF(Aufstellung!F5=\"\",\"Team 3\",Aufstellung!F5)","v":"Team 3"},":",{"$f":"IF(Aufstellung!F11=\"\",\"Team 9\",Aufstellung!F11)","v":"Team 9"},null,":",null,null,{"$f":"B4","v":"Team 2"},":",{"$f":"D6","v":"Team 10"},null,":"]
[null,{"$f":"IF(Aufstellung!H5=\"\",\"Team 4\",Aufstellung!H5)","v":"Team 4"},":",{"$f":"IF(Aufstellung!H11=\"\",\"Team 10\",Aufstellung!H11)","v":"Team 10"},null,":",null,null,{"$f":"B5","v":"Team 3"},":",{"$f":"D7","v":"Team 11"},null,":"]
[null,{"$f":"IF(Aufstellung!J5=\"\",\"Team 5\",Aufstellung!J5)","v":"Team 5"},":",{"$f":"IF(Aufstellung!J11=\"\",\"Team 11\",Aufstellung!J11)","v":"Team 11"},null,":",null,null,{"$f":"B6","v":"Team 4"},":",{"$f":"D8","v":"Team 12"},null,":"]
[null,{"$f":"IF(Aufstellung!L5=\"\",\"Team 6\",Aufstellung!L5)","v":"Team 6"},":",{"$f":"IF(Aufstellung!L11=\"\",\"Team 12\",Aufstellung!L11)","v":"Team 12"},null,":",null,null,{"$f":"B7","v":"Team 5"},":",{"$f":"B8","v":"Team 6"},null,":"]
[null,"frei:",{"$nulls":6},"frei:"]
[]
[]
[null,"Runde 3",{"$nulls":6},"Runde 4"]
[null,{"$f":"I3","v":"Team 1"},":",{"$f":"K4","v":"Team 9"},null,":",null,null,{"$f":"B13","v":"Team 1"},":",{"$f":"D14","v":"Team 10"},null,":"]
[null,{"$f":"K3","v":"Team 8"},":",{"$f":"K5","v":"Team 10"},null,":",null,null,{"$f":"D13","v":"Team 9"},":",{"$f":"D15","v":"Team 11"},null,":"]
[null,{"$f":"I4","v":"Team 7"},":",{"$f":"K6","v":"Team 11"},null,":",null,null,{"$f":"B14","v":"Team 8"},":",{"$f":"D16","v":"Team 12"},null,":"]
[null,{"$f":"I5","v":"Team 2"},":",{"$f":"K7","v":"Team 12"},null,":",null,null,{"$f":"B15","v":"Team 7"},":",{"$f":"D17","v":"Team 6"},null,":"]
[null,{"$f":"I6","v":"Team 3"},":",{"$f":"K8","v":"Team 6"},null,":",null,null,{"$f":"B16","v":"Team 2"},":",{"$f":"D18","v":"Team 5"},null,":"]
[null,{"$f":"I7","v":"Team 4"},":",{"$f":"I8","v":"Team 5"},null,":",null,null,{"$f":"B17","v":"Team 3"},":",{"$f":"B18","v":"Team 4"},null,":"]
[null,"frei:",{"$nulls":6},"frei:"]
[]
[]
[null,"Runde 5",{"$nulls":6},"Runde 6"]
[null,{"$f":"I13","v":"Team 1"},":",{"$f":"K14","v":"Team 11"},null,":",null,null,{"$f":"B23","v":"Team 1"},":",{"$f":"D24","v":"Team 12"},null,":"]
[null,{"$f":"K13","v":"Team 10"},":",{"$f":"K15","v":"Team 12"},null,":",null,null,{"$f":"D23","v":"Team 11"},":",{"$f":"D25","v":"Team 6"},null,":"]
[null,{"$f":"I14","v":"Team 9"},":",{"$f":"K16","v":"Team 6"},null,":",null,null,{"$f":"B24","v":"Team 10"},":",{"$f":"D26","v":"Team 5"},null,":"]
[null,{"$f":"I15","v":"Team 8"},":",{"$f":"K17","v":"Team 5"},null,":",null,null,{"$f":"B25","v":"Team 9"},":",{"$f":"D27","v":"Team 4"},null,":"]
[null,{"$f":"I16","v":"Team 7"},":",{"$f":"K18","v":"Team 4"},null,":",null,null,{"$f":"B26","v":"Team 8"},":",{"$f":"D28","v":"Team 3"},null,":"]
[null,{"$f":"I17","v":"Team 2"},":",{"$f":"I18","v":"Team 3"},null,":",null,null,{"$f":"B27","v":"Team 7"},":",{"$f":"B28","v":"Team 2"},null,":"]
[null,"frei:",{"$nulls":6},"frei:"]
[]
[]
[null,"Runde 7",{"$nulls":6},"Runde 8"]
[null,{"$f":"I23","v":"Team 1"},":",{"$f":"K24","v":"Team 6"},null,":",null,null,{"$f":"B33","v":"Team 1"},":",{"$f":"D34","v":"Team 5"},null,":"]
[null,{"$f":"K23","v":"Team 12"},":",{"$f":"K25","v":"Team 5"},null,":",null,null,{"$f":"D33","v":"Team 6"},":",{"$f":"D35","v":"Team 4"},null,":"]
[null,{"$f":"I24","v":"Team 11"},":",{"$f":"K26","v":"Team 4"},null,":",null,null,{"$f":"B34","v":"Team 12"},":",{"$f":"D36","v":"Team 3"},null,":"]
[null,{"$f":"I25","v":"Team 10"},":",{"$f":"K27","v":"Team 3"},null,":",null,null,{"$f":"B35","v":"Team 11"},":",{"$f":"D37","v":"Team 2"},null,":"]
[null,{"$f":"I26","v":"Team 9"},":",{"$f":"K28","v":"Team 2"},null,":",null,null,{"$f":"B36","v":"Team 10"},":",{"$f":"D38","v":"Team 7"},null,":"]
[null,{"$f":"I27","v":"Team 8"},":",{"$f":"I28","v":"Team 7"},null,":",null,null,{"$f":"B37","v":"Team 9"},":",{"$f":"B38","v":"Team 8"},null,":"]
[null,"frei:",{"$nulls":6},"frei:"]
[]
[]
[null,"Runde 9",{"$nulls":6},"Runde 10"]
[null,{"$f":"I33","v":"Team 1"},":",{"$f":"K34","v":"Team 4"},null,":",null,null,{"$f":"B43","v":"Team 1"},":",{"$f":"D44","v":"Team 3"},null,":"]
[null,{"$f":"K33","v":"Team 5"},":",{"$f":"K35","v":"Team 3"},null,":",null,null,{"$f":"D43","v":"Team 4"},":",{"$f":"D45","v":"Team 2"},null,":"]
[null,{"$f":"I34","v":"Team 6"},":",{"$f":"K36","v":"Team 2"},null,":",null,null,{"$f":"B44","v":"Team 5"},":",{"$f":"D46","v":"Team 7"},null,":"]
[null,{"$f":"I35","v":"Team 12"},":",{"$f":"K37","v":"Team 7"},null,":",null,null,{"$f":"B45","v":"Team 6"},":",{"$f":"D47","v":"Team 8"},null,":"]
[null,{"$f":"I36","v":"Team 11"},":",{"$f":"K38","v":"Team 8"},null,":",null,null,{"$f":"B46","v":"Team 12"},":",{"$f":"D48","v":"Team 9"},null,":"]
[null,{"$f":"I37","v":"Team 10"},":",{"$f":"I38","v":"Team 9"},null,":",null,null,{"$f":"B47","v":"Team 11"},":",{"$f":"B48","v":"Team 10"},null,":"]
[null,"frei:",{"$nulls":6},"frei:"]
[]
[null,"Runde 11"]
[null,{"$f":"I43","v":"Team 1"},":",{"$f":"K44","v":"Team 2"},null,":"]
[null,{"$f":"K43","v":"Team 3"},":",{"$f":"K45","v":"Team 7"},null,":"]
[null,{"$f":"I44","v":"Team 4"},":",{"$f":"K46","v":"Team 8"},null,":"]
[null,{"$f":"I45","v":"Team 5"},":",{"$f":"K47","v":"Team 9"},null,":"]
[null,{"$f":"I46","v":"Team 6"},":",{"$f":"K48","v":"Team 10"},null,":"]
[null,{"$f":"I47","v":"Team 12"},":",{"$f":"I48","v":"Team 11"},null,":"]
[null,"frei:"]